Vocabulario para la representación de datos sobre el censo de locales y terrazas, así como sus actividades económicas y licencias de apertura asociadas.
type: Ontology
version IRI: http://vocab.ciudadesabiertas.es/def/comercio/tejido-comercial/1.1.0
contributor: Honorio Enrique Crespo Díaz-Alejo - Ayuntamiento de Madrid
contributor: María Carmen Ruiz Moreno - Ayuntamiento de Madrid
contributor: María Jesús Fernández Ruiz - Ayuntamiento de Zaragoza
contributor: María Jesús Gallego San Miguel - Ayuntamiento de Madrid
contributor: María del Mar Arribas de Andrés - Ayuntamiento de Madrid
contributor: Red.es
contributor: Servicio de Informática - Ayuntamiento de Santiago de Compostela
contributor: Servicio de Innovación y Desarrollo Tecnológico - Ayuntamiento de A Coruña
contributor: Víctor Morlán Plo - Ayuntamiento de Zaragoza
creator: Paola Espinoza Arias (Ontology Engineering Group - Universidad Politécnica de Madrid)
creator: Oscar Corcho (Ontology Engineering Group - Universidad Politécnica de Madrid, LocaliData)
rights: Creative Commons Attribution 4.0 International (CC BY 4.0)
description: This vocabulary aims to represent data from the census of local businesses, together with their economic activities and opening licenses. It also includes terraces associated to restaurants, cafés, etc. @en
description: Vocabulario para la representación de los datos que provienen del censo de locales, actividades, terrazas de hostelería y restauración y licencias de apertura.
has format: tejido-comercial.owl
issued: 2018-11-02
license: https://creativecommons.org/licenses/by/4.0
title: Vocabulary for the representation of the census of local business premises and terraces, as well as their associated economic activities and opening licenses. @en
preferred namespace prefix: escom
preferred namespace uri: http://vocab.ciudadesabiertas.es/def/comercio/tejido-comercial#
comment: Esta versión ha sido generada dentro del contexto del proyecto "Plataforma de gobierno abierto, colaborativa e interoperable" en el que participan los ayuntamientos de Madrid, Zaragoza, Santiago de Compostela y A Coruña. En esta versión se han agregado metadatos en inglés y se han eliminado los conceptos que fueron descartados en la versión previa: - ZonaComercial - areaInfluencia - medioTransporte - sfContains - tipoAccesibilidad - tipoComercio - accesible - afluenciaPublico
prior version: 0.2.0
version info: 1.1.0

dirección
type: ObjectProperty
range: PostalAddress
label: address @en

dayOfWeek
type: ObjectProperty
domain: OpeningHoursSpecification
range: DayOfWeek
comment: The day of the week for which these opening hours are valid. @en

specialOpeningHoursSpecification
type: ObjectProperty
domain: Place
range: OpeningHoursSpecification
comment: The special opening hours of a certain place. Use this to explicitly override general opening hours brought in scope by openingHoursSpecification or openingHours. @en

pertenece a agrupación comercial
type: ObjectProperty
range: Agrupación Comercial
comment: Any entity (for instance, a local business premise) may belong to a shopping area @en
comment: Cualquier entidad (por ejemplo, un local comercial) puede pertenecer a una agrupación comercial.
label: belongs to shopping area @en

asociada a
type: ObjectProperty
inverse of: tiene licencia de apertura
domain: Licencia de apertura
range: Class
  union of: Local Comercial
  union of: Terraza
comment: An opening license is associated to a local business or terrace. @en
comment: Una licencia de apertura está asociada a un local comercial o a una terraza.
label: associated to @en

autoriza actividad económica
type: ObjectProperty
domain: Licencia de apertura
range: Concept
comment: A license authorizes one or several economic activities. The economic activity type is represented by some SKOS classification, preferably one of the following: http://vocab.linkeddata.es/datosabiertos/kos/comercio/cnae http://vocab.linkeddata.es/datosabiertos/kos/comercio/iae @en
comment: Una licencia autoriza la realización de una o varias actividades económicas. El tipo de actividad económica que se autoriza se representa de acuerdo con alguna clasificación SKOS, preferentemente alguna de las siguientes: http://vocab.linkeddata.es/datosabiertos/kos/comercio/cnae http://vocab.linkeddata.es/datosabiertos/kos/comercio/iae
label: authorizes economic activity @en

contiene local comercial
type: ObjectProperty
range: Local Comercial
comment: An area (for instance, a shopping area) contains local business premises. @en
comment: Una agrupación (por ejemplo, una agrupación comercial) contiene locales comerciales.
label: contains local business premise @en

estado de tramitación
type: ObjectProperty
domain: Licencia de apertura
range: Class
  intersection of: Concept
  intersection of: Restriction
    on property: inScheme
    has value: tipo-estado-tramite-licencia
comment: Estado de tramitación de la licencia, se representa con la lista de conceptos SKOS http://vocab.linkeddata.es/datosabiertos/kos/comercio/tipo-estado-tramite-licencia.
comment: License processing status, it is represented by the SKOS concept list http://vocab.linkeddata.es/datosabiertos/kos/comercio/tipo-estado-tramite-licencia. @en
label: processing status @en

periodo de funcionamiento
type: ObjectProperty
domain: Terraza
range: Class
  intersection of: Concept
  intersection of: Restriction
    on property: inScheme
    has value: periodo-funcionamiento
comment: Periodo de funcionamiento de la terraza, que puede ser anual o estacional. Los periodos se representan mediante la lista de conceptos http://vocab.linkeddata.es/datosabiertos/kos/comercio/periodo-funcionamiento.
comment: Terrace operational period, which can be: annual or seasonal. Periods are represented by the concept list http://vocab.linkeddata.es/datosabiertos/kos/comercio/periodo-funcionamiento. @en
label: operational time period @en

pertenece a local
type: ObjectProperty
inverse of: tiene terraza
domain: Terraza
range: Local Comercial
comment: A terrace belongs to a local business premise. @en
comment: Una terraza pertenece a un local comercial.
label: belongs to local @en

se otorga a
type: ObjectProperty
domain: Licencia de apertura
range: Agent
comment: A license is granted to a holder. @en
comment: Una licencia se otorga a un titular.
label: is granted to @en

tiene licencia de apertura
type: ObjectProperty
domain: Class
  union of: Local Comercial
  union of: Terraza
range: Licencia de apertura
comment: A local business premise may have one or several opening licenses in its history. @en
comment: El local comercial puede tener una o varias licencias de funcionamiento a lo largo de su historia.
label: has opening license @en

tiene terraza
type: ObjectProperty
domain: Local Comercial
range: Terraza
comment: A local business premise may have a terrace. @en
comment: Un local comercial puede tener una terraza asociada.
label: has terrace @en

tipo de acceso
type: ObjectProperty
domain: Local Comercial
range: Class
  intersection of: Concept
  intersection of: Restriction
    on property: inScheme
    has value: tipo-acceso
comment: A local business may have the following access types: street door, interior, or floor. These access types are represented by a list of URI concepts http://vocab.linkeddata.es/datosabiertos/kos/comercio/tipo-acceso. @en
comment: Un local comercial puede tener los siguientes tipos de acceso: puerta de calle, interior, o piso. Estos tipos de acceso se representan mediante una lista de conceptos de URI http://vocab.linkeddata.es/datosabiertos/kos/comercio/tipo-acceso.
label: access type @en

tipo de actividad económica
type: ObjectProperty
domain: Local Comercial
range: Concept
comment: Economic activity type that takes place in a local business premise, according to some SKOS classification. @en
comment: Tipo de actividad económica que se realiza en un local comercial, de acuerdo con alguna clasificación SKOS.
label: economic activity type @en

tipo de agrupación comercial
type: ObjectProperty
domain: Agrupación Comercial
range: Class
  intersection of: Concept
  intersection of: Restriction
    on property: inScheme
    has value: tipo-agrupacion
comment: Type of shopping area, from the concept list http://vocab.linkeddata.es/datosabiertos/kos/comercio/tipo-agrupacion. @en
comment: Tipo de agrupación comercial, de acuerdo con la lista de conceptos http://vocab.linkeddata.es/datosabiertos/kos/comercio/tipo-agrupacion.
label: type of shopping area @en

tipo situación
type: ObjectProperty
domain: Local Comercial
range: Class
  intersection of: Concept
  intersection of: Restriction
    on property: inScheme
    has value: tipo-situacion
comment: A local business may be in any of the following situations: active, closed, closed down, or under construction. These types of situations are represented by a concept list with URI http://vocab.linkeddata.es/datosabiertos/kos/comercio/tipo-situacion . @en
comment: Un local comercial puede estar en una de las siguientes situaciones: activo, cerrado, clausurado, o en obras. Estos tipos de situaciones se representan mediante una lista de conceptos de URI http://vocab.linkeddata.es/datosabiertos/kos/comercio/tipo-situacion.
label: situation type @en

pertenece al barrio
type: ObjectProperty
range: Barrio
issued: 2014-03-28
comment: Barrio al que pertenece un fenómeno geográfico o una entidad administrativa

pertenece al distrito
type: ObjectProperty
range: Distrito
issued: 2014-03-28
comment: Distrito al que pertenece un fenómeno geográfico o una entidad administrativa

pertenece a la sección censal
type: ObjectProperty
range: Sección censal
issued: 2014-03-28
comment: territorio
comment: Sección censal a la que pertenece un fenómeno geográfico o una entidad administrativa

closes
type: DatatypeProperty
domain: OpeningHoursSpecification
range: dateTime
comment: The closing hour of the place or service on the given day(s) of the week. @en

openingHours
type: DatatypeProperty
domain: LocalBusiness
range: string
comment: The general opening hours for a business. Opening hours can be specified as a weekly time range, starting with days, then times per day. Multiple days can be listed with commas ',' separating each day. Day or time ranges are specified using a hyphen '-'. Days are specified using the following two-letter combinations: Mo, Tu, We, Th, Fr, Sa, Su. Times are specified using 24:00 format. For example, 3pm is specified as 15:00, 10am as 10:00. Here is an example: Tuesdays and Thursdays 4-8pm . If a business is open 7 days a week, then it can be specified as Monday through Sunday, all day . @en

opens
type: DatatypeProperty
domain: OpeningHoursSpecification
range: dateTime
comment: The opening hour of the place or service on the given day(s) of the week. @en

telephone
type: DatatypeProperty
domain: Place
range: string
comment: The telephone number. @en

url
type: DatatypeProperty
range: anyURI
comment: URL of the item. @en

validFrom
type: DatatypeProperty
domain: OpeningHoursSpecification
range: dateTime
comment: The date when the item becomes valid. @en

validThrough
type: DatatypeProperty
domain: OpeningHoursSpecification
range: dateTime
comment: The date after when the item is not valid. For example the end of an offer, salary period, or a period of opening hours. @en

aforo
type: DatatypeProperty
domain: Local Comercial
range: int
comment: Capacidad del local, expresada como el número de personas que caben en él.
comment: Local business premise capacity, defined as the number of people that fit in it. @en
label: capacity @en

fecha de alta
type: DatatypeProperty
domain: Licencia de apertura
range: dateTime
comment: Date when the license request has been solved. @en
comment: Fecha en la que se ha resuelto la solicitud de la licencia.
label: release date @en

fecha de cese
type: DatatypeProperty
domain: Licencia de apertura
range: dateTime
comment: Fecha en la que se ha notificado el cese de la actividad económica.
comment: Notification date for the closing of the economic activity. @en
label: closing date @en

fecha de solicitud
type: DatatypeProperty
domain: Licencia de apertura
range: dateTime
comment: Date of the license request. @en
comment: Fecha en la que se ha solicitado la licencia.
label: request date @en

nombre comercial
type: DatatypeProperty
domain: Local Comercial
range: string
comment: El nombre comercial es todo aquel signo que puede ser representado gráficamente y, que identifica a una empresa en el tráfico mercantil distinguiéndola de las demás empresas que van a desarrollar actividades idénticas o similares.
comment: The business name is any type of sign that may be represented graphically and which identifies the business in a business registry. @en
label: business name @en

número de mesas autorizadas
type: DatatypeProperty
domain: Terraza
range: int
comment: Number of tables authorized for the terrace. @en
comment: Número de mesas autorizadas para la terraza.
label: table number @en

número de sillas autorizadas
type: DatatypeProperty
domain: Terraza
range: int
comment: Number of chairs authorized for the terrace. @en
comment: Número de sillas autorizadas para la terraza.
label: number of chairs authorised @en

referencia catastral
type: DatatypeProperty
domain: Local Comercial
range: string
comment: La referencia catastral es el identificador oficial y obligatorio de los bienes inmuebles. Consiste en un código alfanumérico que es asignado por el Catastro de manera que todo inmueble debe tener una única referencia catastral que permita situarlo inequívocamente en la cartografía catastral.
comment: The cadastral reference is the official and mandatory identifier of properties. It consists of an alphanumeric code assigned by the Cadastre to provide a unique cadastral reference to each property in order to place it unequivocally in the cadastral cartography. @en
label: cadastral reference @en

rótulo
type: DatatypeProperty
domain: Local Comercial
range: string
comment: Sign or denomination used to make a commercial establishment known to an audience, and to distinguish it from others used for identical or similar activities. @en
comment: Signo o denominación que sirve para dar a conocer al público un establecimiento comercial y para distinguirlo de otros destinados a actividades idénticas o similares.
label: sign @en

superficie
type: DatatypeProperty
domain: Terraza
range: float
comment: Superficie en metros cuadrados ocupada por la terraza.
comment: The surface in square meters filled by the terrace. @en
label: area @en

xETRS89
type: DatatypeProperty
range: float
source: Catálogo de Objetos Geográficos BTN100.
comment: Coordenada X en metros (ETRS89)

yETRS89
type: DatatypeProperty
range: float
source: Catálogo de Objetos Geográficos BTN100.
comment: Coordenada Y en metros (ETRS89)

LocalBusiness
type: Class
subclass of: Place
comment: A particular physical business or branch of an organization. Examples of LocalBusiness include a restaurant, a particular branch of a restaurant chain, a branch of a bank, a medical practice, a club, a bowling alley, etc. @en

OpeningHoursSpecification
type: Class
comment: A structured value providing information about the opening hours of a place or a certain service inside a place. The place is open if the opens property is specified, and closed otherwise. If the value for the closes property is less than the value for the opens property then the hour range is assumed to span over the next day. @en

Place
type: Class
comment: Entities that have a somewhat fixed, physical extension. @en

PostalAddress
type: Class
comment: The mailing address. @en

Agrupación Comercial
type: Class
subclass of: Place
subclass of: Restriction
  on property: contiene local comercial
  some values from: Local Comercial
subclass of: Restriction
  on property: tipo de agrupación comercial
  min qualified cardinality: 1
  on class: Concept
disjoint with: Terraza
comment: Conjunto de locales situados en uno o en diversos edificios de un mismo espacio comercial, en el cual se pueden llevar a cabo diferentes actividades económicas. Este concepto incluye centros comerciales, mercados, estaciones de tren y metro, etc. Es más genérico que el concepto schema:ShoppingCenter, puesto que puede abordar otros tipos de agrupaciones comerciales (por ejemplo, una calle comercial)
comment: Set of premises placed in one or several buildings of the same business space, where different economic activities may be carried out. This includes shopping centres, markets, train and metro stations, etc. This concept is more general than schema:ShoppingCenter, since it may cover other types of commercial areas, such as a commercial street @en
label: Shopping area @en

Licencia de apertura
type: Class
subclass of: Restriction
  on property: se otorga a
  some values from: Agent
subclass of: Restriction
  on property: asociada a
  all values from: Class
    union of: Local Comercial
    union of: Terraza
subclass of: Restriction
  on property: autoriza actividad económica
  min qualified cardinality: 1
  on class: Concept
subclass of: Restriction
  on property: estado de tramitación
  min qualified cardinality: 1
  on class: Concept
subclass of: Restriction
  on property: asociada a
  qualified cardinality: 1
  on class: Class
    union of: Local Comercial
    union of: Terraza
comment: Acto reglado mediante el cual el Ayuntamiento, previa comprobación del cumplimiento de las condiciones establecidas por la normativa aplicable, autoriza la implantación de la actividad.
comment: Regulated act where the City Council, after checking compliance with the established conditions by the applicable regulations, authorizes carrying out the activity. @en
label: Opening License @en

Local Comercial
type: Class
subclass of: LocalBusiness
subclass of: Feature
subclass of: Restriction
  on property: pertenece a agrupación comercial
  all values from: Agrupación Comercial
subclass of: Restriction
  on property: tiene licencia de apertura
  all values from: Licencia de apertura
subclass of: Restriction
  on property: tiene terraza
  all values from: Terraza
subclass of: Restriction
  on property: tipo de acceso
  min qualified cardinality: 1
  on class: Concept
subclass of: Restriction
  on property: tipo situación
  min qualified cardinality: 1
  on class: Concept
comment: Local donde se puede realizar algún tipo de actividad comercial
comment: Premises where an economic activity can take place. Also referred to as local business in vocabularies like schema.org @en
label: Local Business @en

Terraza
type: Class
subclass of: Place
subclass of: Restriction
  on property: tiene licencia de apertura
  some values from: Licencia de apertura
subclass of: Restriction
  on property: periodo de funcionamiento
  min qualified cardinality: 1
  on class: Concept
subclass of: Restriction
  on property: pertenece a local
  qualified cardinality: 1
  on class: Local Comercial
comment: El uso de una zona de suelo de dominio público o privado afecto al uso público, susceptible de aprovechamientos relacionados con actividades propias de la hostelería, mediante la colocación de mesas, sillas y sombrillas, como zona de extensión o ampliación de la actividad que se ejerce dentro de dichos establecimientos. Dichas instalaciones tienen en todo caso carácter temporal.
comment: The use of a public or private land area affected by public use, to be used in catering activities, through the placement of tables, chairs, and umbrellas, as an extension zone of the activity that takes place within those premises. These facilities are usually temporary. @en
label: Terrace @en

Dirección postal
type: Class
subclass of: PostalAddress
subclass of: Address
issued: 2014-03-28
comment: Una dirección postal en España. Se define como una especialización de las clases vcard:Address, schema:PostalAddress y locn:Address Además de las propiedades asociadas a estas clases, y definidas en su correspondiente vocabulario, también se pueden utilizar las definidas en los vocabularios de división administrativa española (por ejemplo, barrio, distrito y municipio) y en el callejero (por ejemplo, via, tramo y portal), para lo cual se han añadido restricciones universales a esta clase, con el objetivo de dejar esta relación más explícita.

Barrio
type: Class
issued: 2014-03-28
comment: Un barrio es cada una de las partes en que se dividen los pueblos grandes o sus distritos [fuente: Diccionario de la Real Academia (DRAE) 2011]

Distrito
type: Class
comment: Un distrito es cada una de las demarcaciones en que se subdivide un territorio o una población para distribuir y ordenar el ejercicio de los derechos civiles y políticos, o de las funciones públicas, o de los servicios administrativos [fuente: Diccionario de la Real Academia (DRAE) 2011]

Sección censal
type: Class
issued: 2014-03-28
comment: Una sección censal es un referente geográfico de carácter estadístico, cuya actualización se asocia a los trabajos preliminares de todo Padrón Municipal de Habitantes o Censo de Población, siendo un instrumento eficaz tanto en trabajos censales o padronales, así como para investigaciones por muestreo y en el Censo Electoral. [fuente: http://www.madrid.org/iestadis/fijas/clasificaciones/seccioncensal.htm]

Feature
type: Class
subclass of: SpatialObject
disjoint with: Geometry
contributor: Matthew Perry
creator: OGC GeoSPARQL 1.0 Standard Working Group
date: 2011-06-16
description: This class represents the top-level feature type. This class is equivalent to GFI_Feature defined in ISO 19156:2011, and it is superclass of all feature types. @en

HTML

RDF