Vocabulary for the representation of data on traffic made by motor vehicles.
type: Ontology
version IRI: http://vocab.ciudadesabiertas.es/def/transporte/trafico/1.0.0
abstract: Esta es la versión inicial de la ontología de Tráfico que ha sido implementada en el contexto del proyecto Plataforma de gobierno abierto, colaborativa e interoperable en la que participan los ayuntamientos de Madrid, Zaragoza, Santiago de Compostela y A Coruña. @es
abstract: This is the initial version of the vocabulary of Traffic that has been generated within the context of the project Open Government, Collaborative and Interoperable Platform in which partipate the city councils of Madrid, Zaragoza, Santiago de Compostela and A Coruña.
contributor: Ana Bajo Prieto - Ayuntamiento de Madrid @es
contributor: Honorio Enrique Crespo Díaz-Alejo - Ayuntamiento de Madrid @es
contributor: José Antonio Chanca Cáceres - Ayuntamiento de Zaragoza @es
contributor: Juan Antonio López López - Ayuntamiento de A Coruña @es
contributor: María Carmen Ruiz Moreno - Ayuntamiento de Madrid @es
contributor: María Jesús Fernández Ruiz - Ayuntamiento de Zaragoza @es
contributor: María Jesús Gallego San Miguel - Ayuntamiento de Madrid @es
contributor: María del Mar Arribas de Andrés - Ayuntamiento de Madrid @es
contributor: Red.es @es
contributor: Servicio de Informática - Ayuntamiento de Santiago de Compostela @es
contributor: Servicio de Innovación y Desarrollo Tecnológico - Ayuntamiento de A Coruña @es
contributor: Víctor Morlán Plo - Ayuntamiento de Zaragoza @es
creator: Adolfo Antón Bravo (Ontology Engineering Group - Universidad Politécnica de Madrid)
creator: Edna Ruckhaus (Ontology Engineering Group - Universidad Politécnica de Madrid)
creator: Oscar Corcho (Ontology Engineering Group - Universidad Politécnica de Madrid, Localidata)
creator: Paola Espinoza Arias (Ontology Engineering Group - Universidad Politécnica de Madrid)
description: Este vocabulario de tráfico urbano de los vehículos a motor ha sido generado dentro del contexto del proyecto Plataforma de gobierno abierto, colaborativa e interoperable en el que participan los ayuntamientos de Madrid, Zaragoza, Santiago de Compostela y A Coruña. @es
description: This vocabulary of the Urban Traffic run by motor vehicles has been generated within the context of the Open Government, Collaborative and Interoperable Platform in which partipate the city councils of Madrid, Zaragoza, Santiago de Compostela y A Coruña.
rights: Creative Commons Attribution 4.0 International (CC BY 4.0)
title: Vocabulario para la representación de datos sobre el tráfico de vehículos a motor de las ciudades. @es
Created: 2020-06-16
has version: 1.0.0
issued: 2020-06-10 @es
license: https://creativecommons.org/licenses/by/4.0
publisher: Ontology Engineering Group - Universidad Politécnica de Madrid
preferred namespace prefix: estraf
preferred namespace uri: http://vocab.ciudadesabiertas.es/def/transporte/trafico#
comment: Este vocabulario de tráfico urbano de los vehículos a motor ha sido generada dentro del contexto del proyecto Plataforma de gobierno abierto, colaborativa e interoperable en el que participan los ayuntamientos de Madrid, Zaragoza, Santiago de Compostela y A Coruña. @es
comment: This vocabulary version has been generated within the context of the project Open, collaborative and interoperable government platform in which participate the city councils of Madrid, Zaragoza, Santiago de Compostela and A Coruña.
version info: Esta es la versión inicial de la ontología de Tráfico que ha sido implementada en el contexto del proyecto Plataforma de gobierno abierto, colaborativa e interoperable en la que participan los ayuntamientos de Madrid, Zaragoza, Santiago de Compostela y A Coruña. @es
version info: This is the initial version of the vocabulary of Traffic that has been generated within the context of the project Open Government, Collaborative and Interoperable Platform in which partipate the city councils of Madrid, Zaragoza, Santiago de Compostela and A Coruña.

Created
type: AnnotationProperty
domain: date
type: DatatypeProperty
comment: Date of creation of the resource.
comment: Fecha de creación del recurso. @es
label: Creado @es

Date Issued
type: AnnotationProperty
sub property of: date
has version: issued-003
comment: Date of formal issuance (e.g., publication) of the resource.

Section end
type: ObjectProperty
type: FunctionalProperty
domain: Section of Track
range: Geographic Point
comment: Relación del tramo con el lugar donde finaliza el tramo. @es
comment: Relationship of the section with the point where it ends.
label: Fin del Tramo @es

Incidence in Section
type: ObjectProperty
type: FunctionalProperty
domain: Incidence
range: Section of Track
comment: Relación de la Incidencia con el Tramo donde se produce la misma. @es
comment: Relationship of the Incidence withe the Section, where it happens.
label: Incidencia en tramo @es

Section start
type: ObjectProperty
type: FunctionalProperty
domain: Section of Track
range: Geographic Point
comment: Relación del tramo con el lugar donde se inicia el tramo. @es
comment: Relationship of the section with the point where it starts.
label: Inicio del Tramo @es

Monitors
type: ObjectProperty
type: FunctionalProperty
domain: Traffic equipment
range: Section of Track
comment: Relación del Equipo de Tráfico con el Tramo que monitorea @es
comment: Relationship between Traffic Equipment and the Section it monitors
label: Monitorea @es

Type of Traffic Equipment
type: ObjectProperty
type: FunctionalProperty
domain: Traffic equipment
range: Class
  intersection of: Concept
  intersection of: Restriction
    on property: is in scheme
    has value: type of traffic devices
comment: Tipo de equipo de tráfico, equipos de control y dispositivos de medición @es
comment: Type of traffic equipment, monitor equipment or meassuring devices
label: Tipo de Equipo de Tráfico @es

Type of Incidence
type: ObjectProperty
type: FunctionalProperty
domain: Incidence
range: Class
  intersection of: Concept
  intersection of: Restriction
    on property: is in scheme
    has value: type of incidence
comment: Tipo de incidencia, pueden ser planificadas o no planificadas. @es
comment: Type of incidence, planned or unplannedt
label: Tipo de Incidencia @es

Tracks
type: ObjectProperty
domain: Section of Track
range: Street
comment: Relación del Tramo con la/s Vía/s que cubre, en caso de que se digan @es
comment: Relationship of the Section with the Track/s it covers, in case the it is indicated
label: Vía @es

is in scheme
type: ObjectProperty
range: Concept Scheme
label: está en el esquema @es
definition: Relaciona un recurso (por ejemplo un concepto) con un esquema de conceptos en el que está incluido.
definition: Relates a resource (for example a concept) to a concept scheme in which it is included.

Has Beginning
type: ObjectProperty
domain: Proper interval
range: Time instant
comment: Beginning of a temporal entity
comment: Comienzo de una entidad temporal. @es
label: Tiene principio @es

Has End
type: ObjectProperty
domain: Proper interval
range: Time instant
comment: End of a temporal entity
comment: Final de una entidad temporal. @es
label: Tiene final @es

in XSD g-YearMonth
type: ObjectProperty
domain: Time instant
range: Time instant
type: DatatypeProperty
comment: Posición de un instante, expresado utilizando xsd:gYearMonth. @es
comment: Position of an instant, expressed using xsd:gYearMonth
label: en año-mes gregoriano XSD @es

has feature of interest
type: ObjectProperty
domain: Traffic monitoring
range: Section of Track
comment: A relation between an Observation and the entity whose quality was observed.
comment: Una relación entre una Observación y la entidad para la que se ha observado. @es
label: Característica de interés @es

made by sensor
type: ObjectProperty
domain: Traffic monitoring
range: Traffic Measuring Device
comment: Relación entre una Observación y un Sensor que realiza la Observación.
comment: Relation between an Observation and the Sensor which made the Observation. @es
label: realizada por sensor @es

observed property
type: ObjectProperty
domain: Traffic monitoring
range: Traffic meassuring property
comment: Relación que enlaza la propiedad que se observa. @es
comment: Relation linking an Observation to the property that was observed. The ObservableProperty should be a property of the FeatureOfInterest (linked by hasFeatureOfInterest) of this Observation.
label: propiedad observada @es

observes
type: ObjectProperty
domain: Traffic Measuring Device
range: Traffic meassuring property
comment: Relación entre un Sensor y una Propiedad Observada que es capaz de obtener observaciones. @es
comment: Relation between a Sensor and an ObservableProperty that it is capable of sensing.
label: Observa @es

Interval Time
type: ObjectProperty
domain: Observation
range: Proper interval
comment: Esta propiedad establece el intervalo de tiempo de la observación. @es
comment: This property sets the interval of time of the observation
label: Intervalo @es

Description
type: DatatypeProperty
domain: Class
  union of: Traffic equipment
  union of: Incidence
  union of: Section of Track
comment: A description of the resource within a given context.
comment: Una descripción del recurso dentro de un contexto dado. @es
label: Descripción @es

Identifier
type: DatatypeProperty
domain: Class
  union of: Traffic equipment
  union of: Incidence
  union of: Traffic monitoring
  union of: Section of Track
comment: An unambiguous reference to the resource within a given context.
comment: Referencia inequívoca al recurso dentro de un contexto dado. @es
label: Identificador @es

posted incidence date
type: DatatypeProperty
domain: Incidence
range: dateTime
comment: La fecha y hora de publicación de una incidencia (en formato fecha ISO 8601) @es
comment: The end date and time of the incidence (in ISO 8601 date format).
label: fecha de publicación de incidencia @es

end date
type: DatatypeProperty
domain: Incidence
range: dateTime
comment: La fecha y hora de finalización de una incidencia (en formato fecha ISO 8601) @es
comment: The end date and time of an incidence (in ISO 8601 date format).
label: fecha de fin @es

(expected) start date
type: DatatypeProperty
domain: Incidence
range: dateTime
comment: La fecha y hora de inicio de una incidencia (en formato fecha ISO 8601). @es
comment: The start date and time of an incidence (in ISO 8601 date format).
label: fecha de inicio (prevista) @es

Running device
type: DatatypeProperty
sub property of: topDataProperty
domain: Traffic Measuring Device
range: boolean
comment: Esta propiedad permite conocer si el dispositivo funciona o no. @es
comment: This property allows describing whether the device is working or not.
label: En Servicio @es

Recurrent incidence
type: DatatypeProperty
sub property of: topDataProperty
domain: Planned incidence
range: boolean
comment: Esta propiedad permite describir si la incidencia es recurrente o no. @es
comment: This property allows describing whether there is a recurrence in the incidence or not
label: Incidencia recurrente @es

(expected) end date
type: DatatypeProperty
domain: Planned incidence
range: dateTime
comment: La fecha y hora prevista de finalización de una incidencia planificada (en formato fecha ISO 8601) @es
comment: The end date and time of a planned incidence (in ISO 8601 date format).
label: fecha de fin (prevista) @es

Measurement Frequency
type: DatatypeProperty
sub property of: topDataProperty
domain: Traffic Measuring Device
range: string
comment: Esta propiedad permite conocer la frecuencia de medición del dispositivo. @es
comment: This property allows to know the measurement frequency of the device.
label: Frecuencia Medición @es

attached to incidence
type: DatatypeProperty
domain: Incidence
range: anyURI
comment: A document where more information about the incidence can be found.
comment: Un documento donde se puede consultar la información sobre la incidencia. @es
label: adjunto a la incidencia @es

Traffic lanes
type: DatatypeProperty
domain: Class
  union of: Traffic equipment
  union of: Incidence
range: integer
comment: Number of lanes of traffic
comment: Número de carriles de circulación @es
label: Carriles de circulación @es

Street directions
type: DatatypeProperty
domain: Class
  union of: Traffic equipment
  union of: Incidence
range: integer
comment: Number of directions of traffic
comment: Número de sentidos de circulación @es
label: Sentidos de circulación @es

Recurrence
type: DatatypeProperty
sub property of: topDataProperty
domain: Planned incidence
range: string
comment: Esta propiedad permite describir la recurrencia. @es
comment: This property allows describing the recurrence
label: Recurrencia @es

Unit of Measurement
type: DatatypeProperty
sub property of: topDataProperty
domain: Traffic meassuring property
range: string
comment: En el caso del nivel del servicio, las medidas posibles son: verde o fluido; amarillo o lento; naranja o denso; rojo o congestión; negro o circulación interrumpida; gris o sin datos. @es
comment: Esta propiedad permite describir la unidad de medida de la medición del Dispositivo de Medición de Tráfico. @es
comment: In the case of the Service level (nivel), the possible measures are: green or fluid; yellow or slow; orange or dense; red or congestion; black or interrupted circulation; grey or no data.
comment: This property allows describing the unit of measurement of the Trafic Monitoring Device
label: Unidad de Medida @es

Urban
type: DatatypeProperty
sub property of: topDataProperty
domain: Traffic equipment
range: boolean
comment: Esta propiedad permite describir si el dispositivo es urbano o no. @es
comment: This property allows knowing whether the device is urban or not
label: Urbano @es

Validated Observation
type: DatatypeProperty
sub property of: topDataProperty
domain: Traffic monitoring
range: boolean
comment: Esta propiedad permite conocer si se ha producido una validación de la observación o no @es
comment: This property states whether the observation is validated or not.
label: Validada @es

latitude
type: DatatypeProperty
domain: Geographic Point
range: float
comment: Latitud en WGS84 @es
comment: Latitude in WGS84

longitude
type: DatatypeProperty
domain: Geographic Point
range: float
comment: Longitud en WGS84 @es
comment: Longitude in WGS84

Observation Result
type: DatatypeProperty
sub property of: topDataProperty
domain: Traffic monitoring
range: Literal
comment: Esta propiedad muestra el resultado de la observación. @es
comment: This property shows the result of the observation
label: Resultado observación @es

Phenomenon Time
type: DatatypeProperty
sub property of: topDataProperty
domain: Traffic monitoring
range: dateTime
comment: Esta propiedad establece la fecha/hora de la observación. @es
comment: This property sets the dateTime of the observation
label: Hora Observación @es

xETRS89
type: DatatypeProperty
domain: Geographic Point
range: float
source: Catálogo de Objetos Geográficos BTN100. @es
comment: Coordenada X en metros (ETRS89) @es
comment: X-Coordinate in meters (ETRS89)

yETRS89
type: DatatypeProperty
domain: Geographic Point
range: float
source: Catálogo de Objetos Geográficos BTN100. @es
comment: Coordenada Y en metros (ETRS89) @es
comment: Y-Coordinate in meters (ETRS89)

Traffic Measuring Device
type: Class
subclass of: Traffic equipment
subclass of: Sensor
comment: Dispositivo de Medición de Tráfico, tipo de equipo de tráfico que realiza mediciones. @es
comment: Traffic Measuring Device, type of Traffic Device which performs measurements.
label: Dispositivo de medición de tráfico @es

Traffic equipment
type: Class
subclass of: Feature
disjoint with: Incidence
disjoint with: Section of Track
comment: A traffic equipment monitors the traffic of a city
comment: Un Equipo de Tráfico es uno de los equipos que se encargan de controlar o monitorizar el tráfico de la ciudad. @es
label: Equipo de tráfico @es

Incidence
type: Class
subclass of: Feature
disjoint with: Section of Track
comment: Incidence in the traffic system of a city
comment: Incidencia que ocurre en el sistema de tráfico de una ciudad @es
label: Incidencia @es

Unplanned incidence
type: Class
subclass of: Incidence
comment: Incidencia no planificada del tráfico de una ciudad @es
comment: Unplanned traffic incidence
label: Incidencia no planificada @es

Planned incidence
type: Class
subclass of: Incidence
comment: Incidencia planificada, puede ser recurrente o no @es
comment: Planned traffic incidence
label: Incidencia planificada @es

Traffic monitoring
type: Class
subclass of: Observation
comment: Observación realizada por un Dispositivo de Medición de Tráfico @es
comment: Observation by a Traffic Measuring Device
label: Observación del tráfico @es

Traffic meassuring property
type: Class
subclass of: Observable Property
comment: Property of the Meassurement of Traffic: composition, load, occupation, intensity, level or speed.
comment: Propiedad de la Medición de Tráfico: composición, carga, ocupación, intensidad, nivel o velocidad. @es
label: Propiedad Medición Tráfico @es

Section of Track
type: Class
subclass of: Feature
comment: Section/s of a Track defined by a starting and an ending Point.
comment: Tramo definido por un punto de inicio y fin que puede pertenecer a una o más vías @es
label: Tramo @es

Street
type: Class
comment: Part of street network
comment: Parte del callejero @es
label: Vía @es

Feature
type: Class
subclass of: SpatialObject
comment: Esta clase representa una característica de alto nivel, equivalente a GFI_Feature definida en ISP 19156 y es una supercale para todos los tipos de características espaciales.
comment: This class represents the top-level feature type. This class is equivalent to GFI_Feature defined in ISO 19156, and it is superclass of all feature types.
label: Característica geográfica @es

Geometry
type: Class
subclass of: SpatialObject
comment: Esta clase representa el tipo de geometría de alto nivel. Es equivalente a GFI_Geometry definida en ISO 19156 y es superclase de todos los tipos geométricos. @es
comment: This class represents the top-level geometry type. This class is equivalent to GFI_Geometry defined in ISO 19156, and it is superclass of all geometry types.
label: Geometría @es

SpatialObject
type: Class
comment: Esta clase representa un tipo de objeto espacial de alto nivel. Es equivalente a GFI SpatialObject difinido en ISO 19156 y es una superclase de todos los tipos de objetos espaciales. @es
comment: This class represents the top-level spatial object type. This class is equivalent to GFI_SpatialObject defined in ISO 19156, and it is superclass of all spatial object types.
label: Objeto Espacial @es

Geographic Point
type: Class
subclass of: Geometry
comment: Se representa un tipo de punto de alto nivel. Esta clase es equivalente a GFI_Point definida en ISO 19156 y es superclase de todos los tipos de puntos. @es
comment: This class represents the top-level point type. This class is equivalent to GFI_Point defined in ISO 19156, and it is superclass of all point types.
label: Punto geográfico @es

Concept
type: Class
disjoint with: Concept Scheme
issued: 2004-02-xx
label: Concepto @es
definition: An abstract idea or notion; a unit of thought.
definition: Una idea o noción abstracta; una unidad de pensamiento. @es

Concept Scheme
type: Class
comment: A concept scheme may be defined to include concepts from different sources.
comment: Thesauri, classification schemes, subject heading lists, taxonomies, 'folksonomies', and other types of controlled vocabulary are all examples of concept schemes. Concept schemes are also embedded in glossaries and terminologies.
label: Esquema de conceptos @es
definition: A set of concepts, optionally including statements about semantic relationships between those concepts.

Time instant
type: Class
subclass of: Temporal Entity
comment: A temporal entity with zero extent or duration.
comment: Una entidad temporal con extensión o duración de cero. @es
label: Instante de tiempo @es

Time interval
type: Class
subclass of: Temporal Entity
comment: A temporal entity with an extent or duration.
comment: Una entidad temporal con extensión o duración @es
label: intervalo @es

Proper interval
type: Class
subclass of: Time interval
comment: A temporal entity with non-zero extent or duration, i.e. for which the value of the beginning and end are different.
comment: Una entidad temporal con extensión o duración distinta de cero, es decir, para la cual los valores de principio y fin del intervalo son diferentes @es
label: intervalo preciso @es

Temporal Entity
type: Class
comment: A temporal interval or instant.
comment: Un intervalo temporal o un instante. @es
label: Entidad temporal @es

Feature Of Interest
type: Class
comment: The thing whose property is being estimated or calculated in the course of an Observation to arrive at a Result or whose property is being manipulated by an Actuator, or which is being sampled or transformed in an act of Sampling.
example: When measuring the height of a tree, the height is the observed ObservableProperty, 20m may be the Result of the Observation, and the tree is the FeatureOfInterest. A window is a FeatureOfInterest for an automatic window control Actuator.

Observable Property
type: Class
comment: An observable quality (property, characteristic) of a FeatureOfInterest.
example: The height of a tree, the depth of a water body, or the temperature of a surface are examples of observable properties, while the value of a classic car is not (directly) observable but asserted.

Observation
type: Class
comment: Act of carrying out an (Observation) Procedure to estimate or calculate a value of a property of a FeatureOfInterest. Links to a Sensor to describe what made the Observation and how; links to an ObservableProperty to describe what the result is an estimate of, and to a FeatureOfInterest to detail what that property was associated with
definition: Act of carrying out an (Observation) Procedure to estimate or calculate a value of a property of a FeatureOfInterest. Links to a Sensor to describe what made the Observation and how; links to an ObservableProperty to describe what the result is an estimate of, and to a FeatureOfInterest to detail what that property was associated with.
example: The activity of estimating the intensity of an Earthquake using the Mercalli intensity scale is an Observation as is measuring the moment magnitude, i.e., the energy released by said earthquake.

Sensor
type: Class
comment: Device, agent (including humans), or software (simulation) involved in, or implementing, a Procedure. Sensors respond to a stimulus, e.g., a change in the environment, or input data composed from the results of prior Observations, and generate a Result. Sensors can be hosted by Platforms.
example: Accelerometers, gyroscopes, barometers, magnetometers, and so forth are Sensors that are typically mounted on a modern smart phone (which acts as Platform). Other examples of sensors include the human eyes.

traffic load
type: NamedIndividual
type: Traffic meassuring property
comment: It is obtained by the equation of intensity and time of occupation with certain correction factors. It is expressed as a percentage: a 100% load implies circulatory collapse, interrupted circulation, while 0% implies empty street. It is similar to the Level of Service of the road that is usually measured with the letters A, B, C, D, E and F: level A, between 0% and 20% load; level F, between 90% and 100% load. The level of service is complex to measure and that is why the load is used.
comment: Se obtiene mediante ecuación de intensidad y tiempo de ocupación con ciertos factores de corrección. Se expresa en tanto por ciento: una carga del 100% implica colapso circulatorio, circulación interrumpida, mientras que 0% implica calle vacía. Es similar al Nivel de Servicio de la vía que habitualmente se mide con las letras A, B, C, D, E y F: nivel A, entre 0% y 20% de carga; nivel F, entre 90% y 100% de carga. El nivel de servicio es complejo de medir y por eso se usa la carga. @es
label: carga @es

composition
type: NamedIndividual
type: Traffic meassuring property
comment: It is obtained by the equation of intensity and time of occupation with certain correction factors. It is expressed as a percentage: a 100% load implies circulatory collapse, interrupted circulation, while 0% implies empty street. It is similar to the Level of Service of the road that is usually measured with the letters A, B, C, D, E and F: level A, between 0% and 20% load; level F, between 90% and 100% load. The level of service is complex to measure and that is why the load is used.
comment: Se refiere al tipo de vehículos que se suman en la intensidad y a día de hoy sólo se pueden medir a mano mediante muestreo y calcular coeficientes de corrección para las intensidad. Los vehículos se deben referir a vehículos tipo y estiman valores aproximados: turismo=1 ; motocicleta=0,75; Bicicleta=0,5; Autobús=1,5; Camión grande=2. @es
label: composicion @es

traffic intensity
type: NamedIndividual
type: Traffic meassuring property
comment: Intensidad o aforo, número de vehículos en unidad de tiempo (hora, día, mes año). Los habituales son hora y día. @es
comment: Intensity or capacity, number of vehicles in time unit (hour, day, month, year). The usual ones are hour and day.
label: intensidad @es

level
type: NamedIndividual
type: Traffic meassuring property
comment: Calculado a partir de la velocidad, requiere una ecuación o unos niveles de velocidad asociados: verde, fluido; amarillo, lento; naranja, denso; rojo, congestión; negro, circulación interrumpida; gris, sin datos @es
comment: Calculated from the speed, it requires an equation or associated speed levels: green, fluid; yellow, slow; orange, dense; red, congestion; black, traffic interrupted; grey, no data.
label: nivel @es

occupation
type: NamedIndividual
type: Traffic meassuring property
comment: Es la ocupación del detector mientras está pasando por encima un vehículo, está asociado a detectores tipo espira electromagnética, y es el tiempo desde que el detector detecta al vehículo hasta que deja detectarlo. @es
comment: It is the occupation of the detector while it is passing over a vehicle, it is associated with electromagnetic loop type detectors, and it is the time from when the detector detects the vehicle until it allows it to be detected.
label: ocupación @es

speed
type: NamedIndividual
type: Traffic meassuring property
comment: Directly meassured speed with detectors
comment: Velocidad medida directa con detectores @es
label: velocidad @es

type of traffic devices
type: NamedIndividual
type: Concept Scheme
label: tipo de equipo de tráfico @es

type of incidence
type: NamedIndividual
type: Concept Scheme
label: tipo de incidencia @es